{"text_format":"1","workbook":"xlsx","n_sheets":6,"sheets":["Totalscore","Startliste P1","Startliste P2","Startliste P3","Info","Ark1"],"not_rendered":{"charts":0,"images":1,"macros":1,"external_links":0,"defined_names":11,"comments":0,"pivot_tables":0},"unopened":[],"bounds":{"document_bytes":16777216,"sheet_cells":100000,"rows_first":2000,"rows_last":500,"rows_between":2000,"halvings":0,"cell_chars":16384,"cell_head_chars":4096},"cells_cut":0,"cells_raw":0,"read":"whole","date_system":"1900"}

{"sheet":"Totalscore","index":0,"n_rows":260,"n_cols":33,"rows_kept":260,"cut":false,"hidden":false,"merged":[[183,20,183,21],[183,4,183,5],[183,6,183,7],[183,8,183,9],[183,10,183,11],[183,12,183,13],[183,14,183,15],[183,16,183,17],[183,18,183,19],[182,4,182,5],[182,6,182,7],[182,8,182,9],[182,10,182,11],[182,12,182,13],[182,14,182,15],[182,16,182,17],[182,18,182,19],[175,20,175,21],[175,4,175,5],[175,6,175,7],[175,8,175,9],[175,10,175,11],[175,12,175,13],[175,14,175,15],[175,16,175,17],[175,18,175,19],[114,14,114,15],[114,16,114,17],[114,20,114,21],[188,20,188,21],[86,4,86,5],[86,6,86,7],[86,8,86,9],[86,10,86,11],[86,12,86,13],[86,14,86,15],[86,16,86,17],[86,18,86,19],[126,4,126,5],[126,6,126,7],[126,8,126,9],[126,10,126,11],[126,12,126,13],[126,14,126,15],[126,16,126,17],[126,18,126,19],[145,4,145,5],[145,6,145,7],[145,8,145,9],[145,10,145,11],[0,0,2,21],[4,20,4,21],[38,20,38,21],[55,20,55,21],[76,20,76,21],[87,18,87,19],[87,4,87,5],[87,6,87,7],[87,8,87,9],[87,10,87,11],[87,12,87,13],[87,16,87,17],[76,14,76,15],[87,14,87,15],[39,16,39,17],[39,18,39,19],[5,4,5,5],[5,6,5,7],[5,8,5,9],[5,10,5,11],[5,12,5,13],[39,4,39,5],[39,6,39,7],[38,4,38,5],[77,14,77,15],[77,16,77,17],[77,4,77,5],[77,6,77,7],[77,8,77,9],[77,10,77,11],[77,12,77,13],[56,4,56,5],[56,6,56,7],[56,8,56,9],[56,10,56,11],[56,12,56,13],[56,14,56,15],[56,16,56,17],[152,18,152,19],[167,4,167,5],[167,6,167,7],[167,8,167,9],[167,10,167,11],[39,8,39,9],[39,10,39,11],[39,12,39,13],[39,14,39,15],[77,18,77,19],[113,4,113,5],[113,6,113,7],[113,8,113,9],[113,10,113,11],[113,12,113,13],[113,14,113,15],[113,16,113,17],[113,18,113,19],[114,18,114,19],[114,4,114,5],[114,6,114,7],[114,8,114,9],[114,10,114,11],[114,12,114,13],[167,18,167,19],[153,4,153,5],[153,12,153,13],[153,14,153,15],[153,16,153,17],[153,18,153,19],[168,18,168,19],[146,4,146,5],[146,6,146,7],[146,8,146,9],[146,10,146,11],[146,12,146,13],[146,14,146,15],[146,16,146,17],[146,18,146,19],[168,4,168,5],[168,6,168,7],[168,14,168,15],[152,4,152,5],[152,6,152,7],[152,8,152,9],[152,10,152,11],[152,12,152,13],[152,14,152,15],[145,16,145,17],[153,6,153,7],[153,8,153,9],[153,10,153,11],[167,12,167,13],[167,14,167,15],[167,16,167,17],[224,10,224,11],[224,12,224,13],[224,14,224,15],[224,16,224,17],[168,8,168,9],[168,10,168,11],[168,12,168,13],[168,16,168,17],[152,16,152,17],[145,12,145,13],[145,14,145,15],[224,18,224,19],[188,4,188,5],[188,6,188,7],[188,8,188,9],[188,10,188,11],[188,12,188,13],[188,14,188,15],[188,16,188,17],[188,18,188,19],[223,4,223,5],[223,6,223,7],[223,8,223,9],[223,10,223,11],[223,12,223,13],[223,14,223,15],[223,16,223,17],[223,18,223,19],[224,8,224,9],[224,4,224,5],[224,6,224,7],[56,18,56,19],[55,4,55,5],[4,18,4,19],[38,18,38,19],[55,12,55,13],[55,14,55,15],[55,16,55,17],[55,18,55,19],[55,6,55,7],[55,8,55,9],[55,10,55,11],[38,14,38,15],[38,16,38,17],[38,6,38,7],[38,8,38,9],[38,10,38,11],[38,12,38,13],[4,16,4,17],[4,14,4,15],[4,12,4,13],[4,10,4,11],[4,8,4,9],[4,6,4,7],[5,14,5,15],[5,16,5,17],[5,18,5,19],[4,4,4,5],[146,20,146,21],[153,20,153,21],[168,20,168,21],[224,20,224,21],[127,20,127,21],[76,4,76,5],[76,6,76,7],[76,8,76,9],[76,10,76,11],[76,12,76,13],[76,16,76,17],[76,18,76,19],[145,18,145,19],[127,4,127,5],[127,6,127,7],[127,8,127,9],[127,10,127,11],[127,12,127,13],[127,14,127,15],[127,16,127,17],[127,18,127,19]]}
["Resultater 2025"]
[]
[]
[]
["M 6-9",null,null,null,"2025-04-22",null,"2025-05-06",null,"2025-05-13",null,"2025-05-27",null,"2025-06-10",null,"2025-08-12",null,"2025-08-26",null,"2025-09-16",null,null,null,null,"Hjelpeceller"]
["Start nr","Etternavn","Fornavn","Klubb","fullført",null,"fullført",null,"fullført",null,"fullført",null,"fullført",null,"fullført",null,"fullført",null,"fullført",null,"Ant","Premie",null,"Teller"]
[159,"Tveiten","Thilo","Kristiansands CK","fullført",null,"fullført",null,"fullført",null,"fullført",null,null,null,null,null,null,null,"fullført",null,{"$f":"COUNTIF(E7:T7,\"=Fullført\")","v":5},{"$f":"IF(U7>0,VLOOKUP(U7,medaljefordeling,2),0)","v":"Gull"},null,1]
[161,"Aalvik","Andreas","Mandal CK","fullført",null,null,null,null,null,null,null,null,null,null,null,null,null,null,null,1,"Bronse",null,{"$f":"X7+1","v":2}]
[162,"Ormestad","Even Loland","Mandal CK","fullført",null,null,null,null,null,null,null,null,null,null,null,null,null,null,null,1,"Bronse",null,{"$f":"X8+1","v":3}]
[163,"Ormestad","Eskil Loland","Mandal CK","fullført",null,null,null,null,null,null,null,null,null,null,null,null,null,null,null,1,"Bronse",null,4]
[164,"Nilsen","Olav","Mandal CK","fullført",null,null,null,null,null,null,null,null,null,null,null,null,null,null,null,1,"Bronse",null,5]
[165,"Manneråk-Herwig","Samuel","Mandal CK","fullført",null,null,null,null,null,null,null,null,null,null,null,null,null,null,null,1,"Bronse",null,6]
[166,"Markussen","Christian","Kristiansands CK","fullført",null,"fullført",null,"fullført",null,null,null,"fullført",null,"fullført",null,"fullført",null,"fullført",null,7,"Pokal",null,7]
[167,"Storaker","Oskar","Mandal CK","fullført",null,null,null,null,null,null,null,null,null,null,null,null,null,null,null,1,"Bronse",null,8]
[168,"Muren","Casper Dalene","Mandal CK","fullført",null,null,null,null,null,null,null,null,null,null,null,null,null,null,null,1,"Bronse",null,9]
[169,"Heggernes Alvestad","Alrik","Kristiansands CK","fullført",null,"fullført",null,"fullført",null,"fullført",null,"fullført",null,"fullført",null,null,null,"fullført",null,7,"Pokal",null,10]
[170,"Hafslund Rysstad","Henry","Kristiansands CK",null,null,"fullført",null,null,null,"fullført",null,null,null,null,null,null,null,null,null,2,"Bronse",null,11]
[171,"Egeland","Edvald Kverneggen","Kristiansands CK",null,null,"fullført",null,"fullført",null,"fullført",null,null,null,"fullført",null,"fullført",null,null,null,5,"Gull",null,{"$f":"X17+1","v":12}]
[172,"Eigebrekk","Eben","Mandal CK",null,null,"fullført",null,"fullført",null,null,null,null,null,null,null,null,null,"fullført",null,3,"Sølv",null,13]
[173,"Hæstad","Even Forsdal",null,null,null,null,null,null,null,"fullført",null,null,null,null,null,null,null,null,null,1,"Bronse",null,14]
[174,"Hansson","Elliot",null,null,null,null,null,"fullført",null,null,null,null,null,null,null,null,null,null,null,1,"Bronse",null,15]
[176,"Aske Dale","Håkon",null,null,null,null,null,"fullført",null,"fullført",null,null,null,null,null,null,null,"fullført",null,3,"Sølv",null,16]
[182,"Snerthammer","Fadri","Kristiansands CK",null,null,null,null,"fullført",null,"fullført",null,null,null,"fullført",null,"fullført",null,null,null,4,"Sølv",null,17]
[179,"Meyermelin","Sverre",null,null,null,null,null,null,null,"fullført",null,null,null,null,null,null,null,null,null,1,"Bronse",null,18]
[180,"Hide","Lukas","Mandal CK",null,null,null,null,null,null,null,null,"fullført",null,null,null,null,null,null,null,1,"Bronse",null,19]
[183,"Normann","Trym",null,null,null,null,null,null,null,null,null,"fullført",null,null,null,null,null,null,null,1,"Bronse",null,20]
[186,"Coward Markussen","Johannes",null,null,null,null,null,null,null,null,null,null,null,"fullført",null,"fullført",null,"fullført",null,3,"Sølv",null,{"$f":"#REF!+1","v":{"$error":"#REF!"}}]
[187,"Bekkelien","Henrik","Kristiansands CK",null,null,null,null,null,null,null,null,null,null,null,null,"fullført",null,null,null,1,"Bronse",null,{"$error":"#REF!"}]
[188,"Espeland","Einar","Kristiansands CK",null,null,null,null,null,null,null,null,null,null,null,null,"fullført",null,null,null,1,"Bronse",null,{"$error":"#REF!"}]
[189,"Sivertsen","Noah","Kristiansands CK",null,null,null,null,null,null,null,null,null,null,null,null,"fullført",null,"fullført",null,2,"Bronse",null,{"$error":"#REF!"}]
[190,"Kolshus","Casper Gustavsen",null,null,null,null,null,null,null,null,null,null,null,null,null,"fullført",null,null,null,1,"Bronse",null,{"$error":"#REF!"}]
[192,"Aske Dale","Vemund","Kristiansands CK",null,null,null,null,null,null,null,null,null,null,null,null,null,null,"fullført",null,1,"Bronse",null,{"$error":"#REF!"}]
[null,null,null,null,null,null,null,null,null,null,null,null,null,null,null,null,null,null,null,null,0,0,null,{"$error":"#REF!"}]
[null,null,null,null,null,null,null,null,null,null,null,null,null,null,null,null,null,null,null,null,0,0,null,{"$error":"#REF!"}]
[null,null,null,null,null,null,null,null,null,null,null,null,null,null,null,null,null,null,null,null,0,0,null,{"$error":"#REF!"}]
[null,null,null,null,null,null,null,null,null,null,null,null,null,null,null,null,null,null,null,null,0,0,null,{"$error":"#REF!"}]
[null,null,null,null,null,null,null,null,null,null,null,null,null,null,null,null,null,null,null,null,0,0,null,{"$error":"#REF!"}]
[]
["K 6-9",null,null,null,{"$f":"E$5","v":"2025-04-22"},null,{"$f":"G$5","v":"2025-05-06"},null,{"$f":"I$5","v":"2025-05-13"},null,{"$f":"K$5","v":"2025-05-27"},null,{"$f":"M$5","v":"2025-06-10"},null,{"$f":"O$5","v":"2025-08-12"},null,{"$f":"Q$5","v":"2025-08-26"},null,{"$f":"S$5","v":"2025-09-16"},null,"00:00:00",null,null,"Hjelpeceller"]
["Start nr","Etternavn","Fornavn","Klubb","fullført",null,"fullført",null,"fullført",null,"fullført",null,"fullført",null,"fullført",null,"fullført",null,"fullført",null,"Ant","Premie",null,"Teller"]
[160,"Simonsen","Lea Marie","Mandal CK","fullført",null,"fullført",null,"fullført",null,"fullført",null,null,null,null,null,"fullført",null,"fullført",null,{"$f":"COUNTIF(E41:T41,\"=Fullført\")","v":6},{"$f":"IF(U41>0,VLOOKUP(U41,medaljefordeling,2),0)","v":"Gull"},null,1]
[175,"Reinertsen","Ada",null,null,null,null,null,"fullført",null,null,null,null,null,null,null,null,null,null,null,1,"Bronse",null,{"$f":"X41+1","v":2}]
[178,"Helgestad","Mathilde","Mandal CK",null,null,null,null,null,null,"fullført",null,"fullført",null,null,null,null,null,null,null,2,"Bronse",null,{"$f":"X42+1","v":3}]
[181,"Hide","Amelia Ellinor",null,null,null,null,null,null,null,null,null,"fullført",null,null,null,null,null,null,null,1,"Bronse",null,4]
[184,"Normann","Tilde",null,null,null,null,null,null,null,null,null,"fullført",null,null,null,null,null,null,null,1,"Bronse",null,5]
[191,"Bekkelien","Rikke","Kristiansands CK",null,null,null,null,null,null,null,null,null,null,null,null,null,null,"fullført",null,1,"Bronse",null,6]
[null,null,null,null,null,null,null,null,null,null,null,null,null,null,null,null,null,null,null,null,0,0,null,7]
[null,null,null,null,null,null,null,null,null,null,null,null,null,null,null,null,null,null,null,null,0,0,null,8]
[null,null,null,null,null,null,null,null,null,null,null,null,null,null,null,null,null,null,null,null,0,0,null,9]
[null,null,null,null,null,null,null,null,null,null,null,null,null,null,null,null,null,null,null,null,0,0,null,{"$f":"X49+1","v":10}]
[null,null,null,null,null,null,null,null,null,null,null,null,null,null,null,null,null,null,null,null,0,0,null,{"$f":"X50+1","v":11}]
[null,null,null,null,null,null,null,null,null,null,null,null,null,null,null,null,null,null,null,null,0,0,null,12]
[null,null,null,null,null,null,null,null,null,null,null,null,null,null,null,null,null,null,null,null,0,0,null,13]
[null,null,null,null,null,null,null,null,null,null,null,null,null,null,null,null,null,null,null,null,0,0,null,14]
[]
["M 10",null,null,null,{"$f":"E$5","v":"2025-04-22"},null,{"$f":"G$5","v":"2025-05-06"},null,{"$f":"I$5","v":"2025-05-13"},null,{"$f":"K$5","v":"2025-05-27"},null,{"$f":"M$5","v":"2025-06-10"},null,{"$f":"O$5","v":"2025-08-12"},null,{"$f":"Q$5","v":"2025-08-26"},null,{"$f":"S$5","v":"2025-09-16"},null,"00:00:00"]
["Start nr","Etternavn","Fornavn","Klubb","fullført",null,"fullført",null,"fullført",null,"fullført",null,"fullført",null,"fullført",null,"fullført",null,"fullført",null,"Ant","Premie",null,"Teller"]
[230,"Kvidbergskår","Vebjørn","Mandal CK","fullført",null,null,null,"fullført",null,"fullført",null,"fullført",null,null,null,null,null,"fullført",null,{"$f":"COUNTIF(E58:T58,\"=Fullført\")","v":5},{"$f":"IF(U58>0,VLOOKUP(U58,medaljefordeling,2),0)","v":"Gull"},null,1]
[231,"Backstrøm","Noah","Mandal CK","fullført",null,null,null,null,null,null,null,null,null,null,null,null,null,null,null,1,"Bronse",null,{"$f":"X58+1","v":2}]
[232,"Dalene Støle","Mateo","Mandal CK","fullført",null,null,null,null,null,null,null,null,null,null,null,null,null,null,null,1,"Bronse",null,{"$f":"X59+1","v":3}]
[233,"Sandal","Håkon","SK Lyngdal","fullført",null,"fullført",null,null,null,"fullført",null,null,null,null,null,null,null,null,null,3,"Sølv",null,4]
[234,"Simonsen","Isak Andre","Mandal CK","fullført",null,"fullført",null,"fullført",null,"fullført",null,null,null,null,null,"fullført",null,"fullført",null,6,"Gull",null,5]
[235,"Helliesen","Sivert Fedog","Mandal CK","fullført",null,null,null,null,null,null,null,null,null,null,null,null,null,null,null,1,"Bronse",null,6]
[236,"Strømme","Ole Martin Sandum","Mandal CK","fullført",null,null,null,null,null,null,null,null,null,null,null,null,null,null,null,1,"Bronse",null,7]
[237,"Dalene","Andreas","Mandal CK","fullført",null,null,null,null,null,null,null,null,null,null,null,null,null,null,null,1,"Bronse",null,8]
[239,"Sklett Larsen","Jonathan","Kristiansands CK","fullført",null,"fullført",null,null,null,null,null,"fullført",null,"fullført",null,"DNF",null,null,null,4,"Sølv",null,{"$f":"#REF!+1","v":{"$error":"#REF!"}}]
[240,"Glomsaker","Jonathan","Mandal CK","fullført",null,null,null,null,null,null,null,null,null,null,null,null,null,null,null,1,"Bronse",null,{"$f":"X66+1","v":{"$error":"#REF!"}}]
[242,"Aasen","Tobias","Mandal CK","fullført",null,null,null,null,null,null,null,null,null,null,null,null,null,null,null,1,"Bronse",null,{"$error":"#REF!"}]
[246,"Manneråk-Herwig","Ole-Jacob","Mandal CK","fullført",null,null,null,null,null,null,null,null,null,null,null,null,null,null,null,1,"Bronse",null,{"$error":"#REF!"}]
[247,"Kjær Rogstad","Mateo","Søgne CK","fullført",null,"fullført",null,null,null,null,null,null,null,null,null,null,null,null,null,2,"Bronse",null,{"$error":"#REF!"}]
[248,"Rødland","Isak","Kristiansands CK",null,null,"fullført",null,null,null,null,null,null,null,null,null,null,null,null,null,1,"Bronse"]
[254,"Meyermelin","Sigurd",null,null,null,null,null,null,null,"fullført",null,"fullført",null,null,null,null,null,null,null,2,"Bronse"]
[null,"Bergsrønning","Johannes","Kristiansands CK",null,null,null,null,null,null,null,null,null,null,null,null,null,null,"fullført"]
[256,"Sellevåg ","Simon Blegberg","Kristiansands CK",null,null,null,null,null,null,null,null,null,null,null,null,null,null,"fullført"]
[255,"Losinski","Jan","Kristiansands CK",null,null,null,null,null,null,null,null,null,null,null,null,null,null,"fullført",null,1,"Bronse",null,{"$f":"X69+1","v":{"$error":"#REF!"}}]
[null,null,null,null,null,null,null,null,null,null,null,null,null,null,null,null,null,null,null,null,{"$f":"COUNTIF(E76:T76,\"=Fullført\")","v":0},{"$f":"IF(U76>0,VLOOKUP(U76,medaljefordeling,2),0)","v":0},null,{"$f":"X70+1","v":{"$error":"#REF!"}}]
["K 10",null,null,null,{"$f":"E$5","v":"2025-04-22"},null,{"$f":"G$5","v":"2025-05-06"},null,{"$f":"I$5","v":"2025-05-13"},null,{"$f":"K$5","v":"2025-05-27"},null,{"$f":"M$5","v":"2025-06-10"},null,{"$f":"O$5","v":"2025-08-12"},null,{"$f":"Q$5","v":"2025-08-26"},null,{"$f":"S$5","v":"2025-09-16"},null,"00:00:00",null,null,"Hjelpeceller"]
["Start nr","Etternavn","Fornavn","Klubb","fullført",null,"fullført",null,"fullført",null,"fullført",null,"fullført",null,"fullført",null,"fullført",null,"fullført",null,"Ant","Premie",null,"Teller"]
[null,null,null,null,null,null,null,null,null,null,null,null,null,null,null,null,null,null,null,null,{"$f":"COUNTIF(E79:T79,\"=Fullført\")","v":0},{"$f":"IF(U79>0,VLOOKUP(U79,medaljefordeling,2),0)","v":0},null,1]
[null,null,null,null,null,null,null,null,null,null,null,null,null,null,null,null,null,null,null,null,{"$f":"COUNTIF(E80:T80,\"=Fullført\")","v":0},{"$f":"IF(U80>0,VLOOKUP(U80,medaljefordeling,2),0)","v":0},null,{"$f":"X79+1","v":2}]
[null,null,null,null,null,null,null,null,null,null,null,null,null,null,null,null,null,null,null,null,{"$f":"COUNTIF(E81:T81,\"=Fullført\")","v":0},{"$f":"IF(U81>0,VLOOKUP(U81,medaljefordeling,2),0)","v":0},null,{"$f":"X80+1","v":3}]
[null,null,null,null,null,null,null,null,null,null,null,null,null,null,null,null,null,null,null,null,{"$f":"COUNTIF(E82:T82,\"=Fullført\")","v":0},{"$f":"IF(U82>0,VLOOKUP(U82,medaljefordeling,2),0)","v":0},null,4]
[null,null,null,null,null,null,null,null,null,null,null,null,null,null,null,null,null,null,null,null,{"$f":"COUNTIF(E83:T83,\"=Fullført\")","v":0},{"$f":"IF(U83>0,VLOOKUP(U83,medaljefordeling,2),0)","v":0},null,5]
[null,null,null,null,null,null,null,null,null,null,null,null,null,null,null,null,null,null,null,null,null,null,null,6]
[null,null,null,null,null,null,null,null,null,null,null,null,null,null,null,null,null,null,null,null,null,null,null,7]
[null,null,null,null,null,null,null,null,null,null,null,null,null,null,null,null,null,null,null,null,null,null,null,{"$f":"X85+1","v":8}]
[null,null,null,null,"fullført",null,"fullført",null,"fullført",null,"fullført",null,"fullført",null,"fullført",null,"fullført",null,"fullført"]
["M 11-12",null,null,null,{"$f":"E$5","v":"2025-04-22"},null,{"$f":"G$5","v":"2025-05-06"},null,{"$f":"I$5","v":"2025-05-13"},null,{"$f":"K$5","v":"2025-05-27"},null,{"$f":"M$5","v":"2025-06-10"},null,{"$f":"O$5","v":"2025-08-12"},null,{"$f":"Q$5","v":"2025-08-26"},null,{"$f":"S$5","v":"2025-09-16"},null,null,null,null,"Hjelpeceller"]
["Start nr","Etternavn","Fornavn","Klubb","Tid",null,"Tid",null,"Tid",null,"Tid",null,"Tid",null,"Tid",null,"Tid",null,"Tid",null,"Ant","Premie",null,"Teller"]
[228,"Vatland","Liam","Mandal CK","fullført",null,null,null,null,null,null,null,null,null,null,null,null,null,null,null,{"$f":"COUNTIF(E90:T90,\"=Fullført\")+COUNTIF(E90:T90,\">0\")","v":1},{"$f":"IF(U90>0,VLOOKUP(U90,medaljefordeling,2),0)","v":"Bronse"},{"$f":"COUNTIF(E90:T90,\"=Fullført\")","v":1},1]
[238,"Osnes Lian","Erik","Mandal CK","fullført",null,null,null,null,null,null,null,null,null,null,null,null,null,null,null,1,"Bronse",null,{"$f":"X90+1","v":2}]
[240,"Loland Ormestad","Tord","Mandal CK","fullført",null,null,null,null,null,null,null,null,null,null,null,null,null,null,null,1,"Bronse",null,{"$f":"X91+1","v":3}]
[243,"Birkemo","Noah","Mandal CK","fullført",null,null,null,null,null,null,null,null,null,null,null,null,null,null,null,1,"Bronse",null,4]
[249,"Reinertsen","Aron","Kristiansands CK",null,null,"00:17:51",null,"00:11:59",null,null,null,null,null,null,null,null,null,null,null,2,"Bronse",null,5]
[250,"Grosås","Filip",null,null,null,"00:17:01",null,null,null,"00:21:07",null,null,null,"00:20:23",null,null,null,null,null,3,"Sølv",null,6]
[251,"Dalene","Emrik",null,null,null,"00:16:10",null,null,null,null,null,null,null,null,null,null,null,null,null,1,"Bronse",null,7]
[252,"Egeland","Eskil Kverneggen","Kristiansands CK",null,null,"00:12:19",null,"00:13:31",null,null,null,null,null,"00:13:32",null,null,null,"12:06:00",null,4,"Sølv",null,8]
[253,"Nordahl","Mats",null,null,null,null,null,"00:13:24",null,null,null,null,null,null,null,null,null,null,null,1,"Bronse",0,9]
[null,null,null,null,null,null,null,null,null,null,null,null,null,null,null,null,null,null,null,null,0,0,null,10]
[null,null,null,null,null,null,null,null,null,null,null,null,null,null,null,null,null,null,null,null,0,0,null,11]
[null,null,null,null,null,null,null,null,null,null,null,null,null,null,null,null,null,null,null,null,0,0,null,12]
[null,null,null,null,null,null,null,null,null,null,null,null,null,null,null,null,null,null,null,null,0,0,null,13]
[null,null,null,null,null,null,null,null,null,null,null,null,null,null,null,null,null,null,null,null,0,0,null,14]
[null,null,null,null,null,null,null,null,null,null,null,null,null,null,null,null,null,null,null,null,0,0,null,15]
[null,null,null,null,null,null,null,null,null,null,null,null,null,null,null,null,null,null,null,null,0,0,null,16]
[null,null,null,null,null,null,null,null,null,null,null,null,null,null,null,null,null,null,null,null,0,0,null,17]
[null,null,null,null,null,null,null,null,null,null,null,null,null,null,null,null,null,null,null,null,0,0,null,18]
[null,null,null,null,null,null,null,null,null,null,null,null,null,null,null,null,null,null,null,null,0,0,null,19]
[null,null,null,null,null,null,null,null,null,null,null,null,null,null,null,null,null,null,null,null,0,0,null,20]
[null,null,null,null,null,null,null,null,null,null,null,null,null,null,null,null,null,null,null,null,0,0,null,21]
[null,null,null,null,null,null,null,null,null,null,null,null,null,null,null,null,null,null,null,null,0,0,null,22]
[null,null,null,null,null,null,null,null,null,null,null,null,null,null,null,null,null,null,null,null,0,0,{"$f":"COUNTIF(E112:T112,\"=Fullført\")","v":0},23]
[]
[null,null,null,null,"fullført",null,"fullført",null,"fullført",null,"fullført",null,"fullført",null,"fullført",null,"fullført",null,"fullført",null,null,null,{"$f":"COUNTIF(E114:T114,\"=Fullført\")","v":8}]
["K 11-12",null,null,null,{"$f":"E$5","v":"2025-04-22"},null,{"$f":"G$5","v":"2025-05-06"},null,{"$f":"I$5","v":"2025-05-13"},null,{"$f":"K$5","v":"2025-05-27"},null,{"$f":"M$5","v":"2025-06-10"},null,{"$f":"O$5","v":"2025-08-12"},null,{"$f":"Q$5","v":"2025-08-26"},null,{"$f":"S$5","v":"2025-09-16"},null,"00:00:00",null,null,"Hjelpeceller"]
["Start nr","Etternavn","Fornavn","Klubb","Tid",null,"Tid",null,"Tid",null,"Tid",null,"Tid",null,"Tid",null,"Tid",null,"Tid",null,"Ant","Premie",null,"Teller"]
[244,"Ellingsæter","Lilly Stusvik","Mandal CK","fullført",null,"00:14:54",null,"00:15:32",null,"00:15:40",null,"00:14:32",null,"00:16:02",null,null,null,"00:14:35",null,{"$f":"COUNTIF(E117:T117,\"=Fullført\")+COUNTIF(E117:T117,\">0\")","v":7},{"$f":"IF(U117>0,VLOOKUP(U117,medaljefordeling,2),0)","v":"Pokal"},null,1]
[245,"Helgestad","Emilie","Mandal CK","fullført",null,"00:12:38",null,"00:17:54",null,"00:17:19",null,"00:18:49",null,"00:17:24",null,null,null,"00:16:30",null,7,"Pokal",null,{"$f":"X117+1","v":2}]
[null,null,null,null,null,null,null,null,null,null,null,null,null,null,null,null,null,null,null,null,0,0,null,{"$f":"X118+1","v":3}]
[null,null,null,null,null,null,null,null,null,null,null,null,null,null,null,null,null,null,null,null,0,0,null,4]
[null,null,null,null,null,null,null,null,null,null,null,null,null,null,null,null,null,null,null,null,0,0,null,5]
[null,null,null,null,null,null,null,null,null,null,null,null,null,null,null,null,null,null,null,null,0,0,null,6]
[null,null,null,null,null,null,null,null,null,null,null,null,null,null,null,null,null,null,null,null,0,0,null,7]
[null,null,null,null,null,null,null,null,null,null,null,null,null,null,null,null,null,null,null,null,0,0,null,8]
[null,null,null,null,null,null,null,null,null,null,null,null,null,null,null,null,null,null,null,null,0,0,{"$f":"COUNTIF(E125:T125,\"=Fullført\")","v":0},9]
[null,null,null,null,null,null,null,null,null,null,null,null,null,null,null,null,null,null,null,null,0,0,0,10]
[]
["M 13-14",null,null,null,{"$f":"E$5","v":"2025-04-22"},null,{"$f":"G$5","v":"2025-05-06"},null,{"$f":"I$5","v":"2025-05-13"},null,{"$f":"K$5","v":"2025-05-27"},null,{"$f":"M$5","v":"2025-06-10"},null,{"$f":"O$5","v":"2025-08-12"},null,{"$f":"Q$5","v":"2025-08-26"},null,{"$f":"S$5","v":"2025-09-16"},null,"RANK",null,null,"Hjelpeceller"]
["Start nr","Etternavn","Fornavn","Klubb","Tid","poeng","Tid","poeng","Tid","poeng","Tid","poeng","Tid","poeng","Tid","poeng","Tid","poeng","Tid","poeng","PLASS","POENG",null,"Teller",{"$f":"$E$5","v":"2025-04-22"},{"$f":"$G$5","v":"2025-05-06"},{"$f":"$I$5","v":"2025-05-13"},{"$f":"$K$5","v":"2025-05-27"},{"$f":"$M$5","v":"2025-06-10"},{"$f":"$O$5","v":"2025-08-12"},{"$f":"$Q$5","v":"2025-08-26"},{"$f":"$S$5","v":"2025-09-16"},{"$f":"V5","v":"00:00:00"}]
[229,"Johannesen","William","Mandal CK","00:38:00",6,null,null,null,null,null,null,null,null,null,null,null,null,null,null,{"$f":"IF(V130>0,_xlfn.RANK.EQ(V130,V$130:V$145),0)","v":9},{"$f":"F130+H130+J130+L130+N130+P130+R130+T130","v":6},null,1,{"$f":"IF(OR(E130=\"\",E130=\"DNS\",E130=\"DNF\"),0,_xlfn.RANK.EQ(E130,E$130:E$145,1))","v":4},{"$f":"IF(OR(G130=\"\",G130=\"DNS\",G130=\"DNF\"),0,_xlfn.RANK.EQ(G130,G$130:G$145,1))","v":0},{"$f":"IF(OR(I130=\"\",I130=\"DNS\",I130=\"DNF\"),0,_xlfn.RANK.EQ(I130,I$130:I$145,1))","v":0},{"$f":"IF(OR(K130=\"\",K130=\"DNS\",K130=\"DNF\"),0,_xlfn.RANK.EQ(K130,K$130:K$145,1))","v":0},{"$f":"IF(OR(M130=\"\",M130=\"DNS\",M130=\"DNF\"),0,_xlfn.RANK.EQ(M130,M$130:M$145,1))","v":0},{"$f":"IF(OR(O130=\"\",O130=\"DNS\",O130=\"DNF\"),0,_xlfn.RANK.EQ(O130,O$130:O$145,1))","v":0},{"$f":"IF(OR(Q130=\"\",Q130=\"DNS\",Q130=\"DNF\"),0,_xlfn.RANK.EQ(Q130,Q$130:Q$145,1))","v":0},{"$f":"IF(OR(S130=\"\",S130=\"DNS\",S130=\"DNF\"),0,_xlfn.RANK.EQ(S130,S$130:S$145,1))","v":0}]
[327,"Simonsen","Brage Tobias","Mandal CK","DNS",null,"00:26:53",8,"00:25:14",10,"00:26:31",8,null,null,"00:29:28",7,null,null,"00:31:41",7,3,40,null,{"$f":"X130+1","v":2},0,2,1,2,0,3,0,3]
[328,"Sinniger","Lucas"," Arendal CC","00:24:38",10,"00:23:58",10,"DNS",null,"00:24:31",10,"00:24:42",10,"00:21:45",10,"00:21:14",10,"00:22:03",10,1,70,null,{"$f":"X131+1","v":3},1,1,0,1,1,1,{"$f":"IF(OR(Q132=\"\",Q132=\"DNS\",Q132=\"DNF\"),0,_xlfn.RANK.EQ(Q132,Q$130:Q$145,1))","v":1},1]
[329,"Ellingsæther","Mandius Stusvik","Mandal CK","00:27:42",8,"00:29:23",6,"DNF",null,"00:32:56",6,"00:28:38",8,"00:27:37",8,"00:24:44",8,"00:26:57",8,2,52,null,4,2,4,0,{"$f":"IF(OR(K133=\"\",K133=\"DNS\",K133=\"DNF\"),0,_xlfn.RANK.EQ(K133,K$130:K$145,1))","v":4},2,2,{"$f":"IF(OR(Q133=\"\",Q133=\"DNS\",Q133=\"DNF\"),0,_xlfn.RANK.EQ(Q133,Q$130:Q$145,1))","v":2},2]
[330,"Hermansen","Nicolai","Mandal CK","00:34:56",7,null,null,null,null,null,null,null,null,null,null,null,null,null,null,6,7,null,5,3,0,{"$f":"IF(OR(I134=\"\",I134=\"DNS\",I134=\"DNF\"),0,_xlfn.RANK.EQ(I134,I$130:I$145,1))","v":0},{"$f":"IF(OR(K134=\"\",K134=\"DNS\",K134=\"DNF\"),0,_xlfn.RANK.EQ(K134,K$130:K$145,1))","v":0},0,0,0,0]
[331,"Tønnesen","Richard",null,null,null,"00:34:35",5,"00:39:59",7,"00:38:58",5,null,null,"00:35:08",6,null,null,null,null,4,23,null,6,0,5,{"$f":"IF(OR(I135=\"\",I135=\"DNS\",I135=\"DNF\"),0,_xlfn.RANK.EQ(I135,I$130:I$145,1))","v":3},5,0,4,0,0]
[332,"Hovet","Sondre","Kristiansands CK",null,null,"00:28:22",7,"00:29:11",8,null,null,null,null,null,null,null,null,null,null,5,15,null,7,0,3,2,0,0,0,0,0]
[334,"Nomedal","Sebastian Skogsfjord","Mandal CK",null,null,null,null,null,null,"00:30:16",7,null,null,null,null,null,null,null,null,6,7,null,8,0,0,0,3,0,0,0,0]
[335,"Katralen","Matheo","Kristiansands CK",null,null,null,null,null,null,null,null,null,null,null,null,1.25,7,null,null,6,7,null,9,0,0,0,0,0,0,3,0]
[null,null,null,null,null,null,null,null,null,null,null,null,null,null,null,null,null,null,null,null,0,0,null,10,0,0,0,0,0,0,0,0]
[null,null,null,null,null,{"$f":"IF($Y140=0,0,VLOOKUP($Y140,Rangeringskalkulator,2,FALSE))","v":0},null,{"$f":"IF($Z140=0,0,VLOOKUP($Z140,Rangeringskalkulator,2,FALSE))","v":0},null,{"$f":"IF($AA140=0,0,VLOOKUP($AA140,Rangeringskalkulator,2,FALSE))","v":0},null,{"$f":"IF($AB140=0,0,VLOOKUP($AB140,Rangeringskalkulator,2,FALSE))","v":0},null,{"$f":"IF($AC140=0,0,VLOOKUP($AC140,Rangeringskalkulator,2,FALSE))","v":0},null,{"$f":"IF($AD140=0,0,VLOOKUP($AD140,Rangeringskalkulator,2,FALSE))","v":0},null,{"$f":"IF($AE140=0,0,VLOOKUP($AE140,Rangeringskalkulator,2,FALSE))","v":0},null,{"$f":"IF($AF140=0,0,VLOOKUP($AF140,Rangeringskalkulator,2,FALSE))","v":0},0,0,null,11,0,0,0,0,0,0,0,0]
[null,null,null,null,null,0,null,0,null,0,null,0,null,0,null,0,null,0,null,0,0,0,null,12,0,0,0,0,0,0,0,0]
[null,null,null,null,null,0,null,0,null,0,null,0,null,0,null,0,null,0,null,0,0,0,null,13,0,0,0,0,0,0,0,0]
[null,null,null,null,null,0,null,0,null,0,null,0,null,0,null,0,null,0,null,0,0,0,null,14,0,0,0,0,0,0,0,0]
[null,null,null,null,null,0,null,0,null,0,null,0,null,0,null,0,null,0,null,0,0,0,null,15,0,0,0,0,0,0,0,0]
[null,null,null,null,null,0,null,0,null,0,null,0,null,0,null,0,null,0,null,0,0,0,null,16,0,0,0,0,0,0,0,0]
[]
["K 13-14",null,null,null,{"$f":"E$5","v":"2025-04-22"},null,{"$f":"G$5","v":"2025-05-06"},null,{"$f":"I$5","v":"2025-05-13"},null,{"$f":"K$5","v":"2025-05-27"},null,{"$f":"M$5","v":"2025-06-10"},null,{"$f":"O$5","v":"2025-08-12"},null,{"$f":"Q$5","v":"2025-08-26"},null,{"$f":"S$5","v":"2025-09-16"},null,"RANK",null,null,"Hjelpeceller"]
["Start nr","Etternavn","Fornavn","Klubb","Tid","poeng","Tid","poeng","Tid","poeng","Tid","poeng","Tid","poeng","Tid","poeng","Tid","poeng","Tid","poeng","PLASS","POENG",null,"Teller",{"$f":"$E$5","v":"2025-04-22"},{"$f":"$G$5","v":"2025-05-06"},{"$f":"$I$5","v":"2025-05-13"},{"$f":"$K$5","v":"2025-05-27"},{"$f":"$M$5","v":"2025-06-10"},{"$f":"$O$5","v":"2025-08-12"},{"$f":"$Q$5","v":"2025-08-26"},{"$f":"$S$5","v":"2025-09-16"},{"$f":"V35","v":"00:00:00"}]
[333,"Mykland","Ingrid","Kristiansandds CK",null,null,"00:18:05",10,null,null,null,null,null,null,null,null,null,null,null,null,{"$f":"IF(V149>0,_xlfn.RANK.EQ(V149,V$149:V$152),0)","v":1},{"$f":"F149+H149+J149+L149+N149+P149+R149+T149","v":10},null,1,{"$f":"IF(OR(E149=\"\",E149=\"DNS\",E149=\"DNF\"),0,_xlfn.RANK.EQ(E149,E$149:E$152,1))","v":0},{"$f":"IF(OR(G149=\"\",G149=\"DNS\",G149=\"DNF\"),0,_xlfn.RANK.EQ(G149,G$149:G$152,1))","v":1},{"$f":"IF(OR(I149=\"\",I149=\"DNS\",I149=\"DNF\"),0,_xlfn.RANK.EQ(I149,I$149:I$152,1))","v":0},{"$f":"IF(OR(K149=\"\",K149=\"DNS\",K149=\"DNF\"),0,_xlfn.RANK.EQ(K149,K$149:K$152,1))","v":0},{"$f":"IF(OR(M149=\"\",M149=\"DNS\",M149=\"DNF\"),0,_xlfn.RANK.EQ(M149,M$149:M$152,1))","v":0},{"$f":"IF(OR(O149=\"\",O149=\"DNS\",O149=\"DNF\"),0,_xlfn.RANK.EQ(O149,O$149:O$152,1))","v":0},{"$f":"IF(OR(Q149=\"\",Q149=\"DNS\",Q149=\"DNF\"),0,_xlfn.RANK.EQ(Q149,Q$149:Q$152,1))","v":0},{"$f":"IF(OR(S149=\"\",S149=\"DNS\",S149=\"DNF\"),0,_xlfn.RANK.EQ(S149,S$149:S$152,1))","v":0}]
[null,null,null,null,null,null,null,null,null,null,null,null,null,null,null,null,null,null,null,null,{"$f":"IF(V150>0,_xlfn.RANK.EQ(V150,V$149:V$152),0)","v":0},{"$f":"F150+H150+J150+L150+N150+P150+R150+T150","v":0},null,{"$f":"X149+1","v":2},{"$f":"IF(OR(E150=\"\",E150=\"DNS\",E150=\"DNF\"),0,_xlfn.RANK.EQ(E150,E$149:E$152,1))","v":0},{"$f":"IF(OR(G150=\"\",G150=\"DNS\",G150=\"DNF\"),0,_xlfn.RANK.EQ(G150,G$149:G$152,1))","v":0},{"$f":"IF(OR(I150=\"\",I150=\"DNS\",I150=\"DNF\"),0,_xlfn.RANK.EQ(I150,I$149:I$152,1))","v":0},{"$f":"IF(OR(K150=\"\",K150=\"DNS\",K150=\"DNF\"),0,_xlfn.RANK.EQ(K150,K$149:K$152,1))","v":0},{"$f":"IF(OR(M150=\"\",M150=\"DNS\",M150=\"DNF\"),0,_xlfn.RANK.EQ(M150,M$149:M$152,1))","v":0},{"$f":"IF(OR(O150=\"\",O150=\"DNS\",O150=\"DNF\"),0,_xlfn.RANK.EQ(O150,O$149:O$152,1))","v":0},{"$f":"IF(OR(Q150=\"\",Q150=\"DNS\",Q150=\"DNF\"),0,_xlfn.RANK.EQ(Q150,Q$149:Q$152,1))","v":0},{"$f":"IF(OR(S150=\"\",S150=\"DNS\",S150=\"DNF\"),0,_xlfn.RANK.EQ(S150,S$149:S$152,1))","v":0}]
[null,null,null,null,null,null,null,null,null,null,null,null,null,null,null,null,null,null,null,{"$f":"IF($AF151=0,0,VLOOKUP($AF151,Rangeringskalkulator,2,FALSE))","v":0},{"$f":"IF(V151>0,_xlfn.RANK.EQ(V151,V$149:V$152),0)","v":0},{"$f":"F151+H151+J151+L151+N151+P151+R151+T151","v":0},null,{"$f":"X150+1","v":3},0,0,0,0,0,0,0,0]
[null,null,null,null,null,null,null,null,null,null,null,null,null,null,null,null,null,null,null,{"$f":"IF($AF152=0,0,VLOOKUP($AF152,Rangeringskalkulator,2,FALSE))","v":0},{"$f":"IF(V152>0,_xlfn.RANK.EQ(V152,V$149:V$152),0)","v":0},{"$f":"F152+H152+J152+L152+N152+P152+R152+T152","v":0},null,4,0,0,0,0,0,0,0,0]
[]
["M 15-16",null,null,null,{"$f":"E$5","v":"2025-04-22"},null,{"$f":"G$5","v":"2025-05-06"},null,{"$f":"I$5","v":"2025-05-13"},null,{"$f":"K$5","v":"2025-05-27"},null,{"$f":"M$5","v":"2025-06-10"},null,{"$f":"O$5","v":"2025-08-12"},null,{"$f":"Q$5","v":"2025-08-26"},null,{"$f":"S$5","v":"2025-09-16"},null,"RANK",null,null,"Hjelpeceller"]
["Start nr","Etternavn","Fornavn","Klubb","Tid","poeng","Tid","poeng","Tid","poeng","Tid","poeng","Tid","poeng","Tid","poeng","Tid","poeng","Tid","poeng","PLASS","POENG",null,"Teller",{"$f":"$E$5","v":"2025-04-22"},{"$f":"$G$5","v":"2025-05-06"},{"$f":"$I$5","v":"2025-05-13"},{"$f":"$K$5","v":"2025-05-27"},{"$f":"$M$5","v":"2025-06-10"},{"$f":"$O$5","v":"2025-08-12"},{"$f":"$Q$5","v":"2025-08-26"},{"$f":"$S$5","v":"2025-09-16"}]
[429,"Fasseland","Jonas","Mandal CK","00:38:30",10,null,null,"00:25:21",10,"00:27:10",10,"00:27:20",10,null,null,null,null,null,null,{"$f":"IF(V156>0,_xlfn.RANK.EQ(V156,V$156:V$167),0)","v":2},{"$f":"F156+H156+J156+L156+N156+P156+R156+T156","v":40},null,1,{"$f":"IF(OR(E156=\"\",E156=\"DNS\",E156=\"DNF\"),0,_xlfn.RANK.EQ(E156,E$156:E$167,1))","v":1},{"$f":"IF(OR(G156=\"\",G156=\"DNS\",G156=\"DNF\"),0,_xlfn.RANK.EQ(G156,G$156:G$167,1))","v":0},{"$f":"IF(OR(I156=\"\",I156=\"DNS\",I156=\"DNF\"),0,_xlfn.RANK.EQ(I156,I$156:I$167,1))","v":1},{"$f":"IF(OR(K156=\"\",K156=\"DNS\",K156=\"DNF\"),0,_xlfn.RANK.EQ(K156,K$156:K$167,1))","v":1},{"$f":"IF(OR(M156=\"\",M156=\"DNS\",M156=\"DNF\"),0,_xlfn.RANK.EQ(M156,M$156:M$167,1))","v":1},{"$f":"IF(OR(O156=\"\",O156=\"DNS\",O156=\"DNF\"),0,_xlfn.RANK.EQ(O156,O$156:O$167,1))","v":0},{"$f":"IF(OR(Q156=\"\",Q156=\"DNS\",Q156=\"DNF\"),0,_xlfn.RANK.EQ(Q156,Q$156:Q$167,1))","v":0},{"$f":"IF(OR(S156=\"\",S156=\"DNS\",S156=\"DNF\"),0,_xlfn.RANK.EQ(S156,S$156:S$167,1))","v":0}]
[430,"Tregde","Marcus","Mandal CK","DNF",null,"00:25:28",10,"00:27:53",8,"00:27:10",8,"00:28:24",8,"00:27:08",10,"00:26:29",10,"00:28:32",10,1,64,null,{"$f":"X156+1","v":2},0,1,2,1,2,1,1,1]
[null,null,null,null,null,null,null,null,null,null,null,null,null,null,null,null,null,null,null,null,0,0,null,3,0,0,0,0,0,0,0,0]
[null,null,null,null,null,null,null,null,null,null,null,null,null,null,null,null,null,{"$f":"IF($AE159=0,0,VLOOKUP($AE159,Rangeringskalkulator,2,FALSE))","v":0},null,{"$f":"IF($AF159=0,0,VLOOKUP($AF159,Rangeringskalkulator,2,FALSE))","v":0},0,0,null,4,0,0,0,0,0,0,0,0]
[null,null,null,null,null,null,null,null,null,null,null,null,null,null,null,null,null,0,null,0,0,0,null,5,0,0,0,0,0,0,0,0]
[null,null,null,null,null,null,null,null,null,null,null,null,null,null,null,null,null,0,null,0,0,0,null,6,0,0,0,0,0,0,0,0]
[null,null,null,null,null,null,null,null,null,null,null,null,null,null,null,null,null,0,null,0,0,0,null,7,0,0,0,0,0,0,0,0]
[null,null,null,null,null,null,null,null,null,null,null,null,null,null,null,null,null,0,null,0,0,0,null,8,0,0,0,0,0,0,0,0]
[null,null,null,null,null,{"$f":"IF($Y164=0,0,VLOOKUP($Y164,Rangeringskalkulator,2,FALSE))","v":0},null,{"$f":"IF($Z164=0,0,VLOOKUP($Z164,Rangeringskalkulator,2,FALSE))","v":0},null,{"$f":"IF($AA164=0,0,VLOOKUP($AA164,Rangeringskalkulator,2,FALSE))","v":0},null,{"$f":"IF($AB164=0,0,VLOOKUP($AB164,Rangeringskalkulator,2,FALSE))","v":0},null,{"$f":"IF($AC164=0,0,VLOOKUP($AC164,Rangeringskalkulator,2,FALSE))","v":0},null,{"$f":"IF($AD164=0,0,VLOOKUP($AD164,Rangeringskalkulator,2,FALSE))","v":0},null,0,null,0,0,0,null,9,0,0,0,0,0,0,0,0]
[null,null,null,null,null,0,null,0,null,0,null,0,null,0,null,0,null,0,null,0,0,0,null,10,0,0,0,0,0,0,0,0]
[null,null,null,null,null,0,null,0,null,0,null,0,null,0,null,0,null,0,null,0,0,0,null,11,0,0,0,0,0,0,0,0]
[null,null,null,null,null,0,null,0,null,0,null,0,null,0,null,0,null,0,null,0,0,0,null,12,0,0,0,0,0,0,0,0]
[null,null,null,null,null,null,null,null,null,null,null,null,null,null,null,null,"00:40:09"]
["K 15-16",null,null,null,{"$f":"E$5","v":"2025-04-22"},null,{"$f":"G$5","v":"2025-05-06"},null,{"$f":"I$5","v":"2025-05-13"},null,{"$f":"K$5","v":"2025-05-27"},null,{"$f":"M$5","v":"2025-06-10"},null,{"$f":"O$5","v":"2025-08-12"},null,{"$f":"Q$5","v":"2025-08-26"},null,{"$f":"S$5","v":"2025-09-16"},null,"RANK",null,null,"Hjelpeceller"]
["Start nr","Etternavn","Fornavn","Klubb","Tid","poeng","Tid","poeng","Tid","poeng","Tid","poeng","Tid","poeng","Tid","poeng","Tid","poeng","Tid","poeng","PLASS","POENG",null,"Teller",{"$f":"$E$5","v":"2025-04-22"},{"$f":"$G$5","v":"2025-05-06"},{"$f":"$I$5","v":"2025-05-13"},{"$f":"$K$5","v":"2025-05-27"},{"$f":"$M$5","v":"2025-06-10"},{"$f":"$O$5","v":"2025-08-12"},{"$f":"$Q$5","v":"2025-08-26"},{"$f":"$S$5","v":"2025-09-16"},{"$f":"V52","v":"00:00:00"}]
[null,null,null,null,null,null,null,null,null,null,null,null,null,null,null,null,null,null,null,null,{"$f":"IF(V171>0,_xlfn.RANK.EQ(V171,V$171:V$174),0)","v":0},{"$f":"F171+H171+J171+L171+N171+P171+R171+T171","v":0},null,1,{"$f":"IF(OR(E171=\"\",E171=\"DNS\",E171=\"DNF\"),0,_xlfn.RANK.EQ(E171,E$171:E$174,1))","v":0},{"$f":"IF(OR(G171=\"\",G171=\"DNS\",G171=\"DNF\"),0,_xlfn.RANK.EQ(G171,G$171:G$174,1))","v":0},{"$f":"IF(OR(I171=\"\",I171=\"DNS\",I171=\"DNF\"),0,_xlfn.RANK.EQ(I171,I$171:I$174,1))","v":0},{"$f":"IF(OR(K171=\"\",K171=\"DNS\",K171=\"DNF\"),0,_xlfn.RANK.EQ(K171,K$171:K$181,1))","v":0},{"$f":"IF(OR(M171=\"\",M171=\"DNS\",M171=\"DNF\"),0,_xlfn.RANK.EQ(M171,M$171:M$181,1))","v":0},{"$f":"IF(OR(O171=\"\",O171=\"DNS\",O171=\"DNF\"),0,_xlfn.RANK.EQ(O171,O$171:O$181,1))","v":0},{"$f":"IF(OR(Q171=\"\",Q171=\"DNS\",Q171=\"DNF\"),0,_xlfn.RANK.EQ(Q171,Q$171:Q$181,1))","v":0},{"$f":"IF(OR(S171=\"\",S171=\"DNS\",S171=\"DNF\"),0,_xlfn.RANK.EQ(S171,S$171:S$181,1))","v":0}]
[null,null,null,null,null,null,null,null,null,null,null,null,null,null,null,null,null,null,null,null,{"$f":"IF(V172>0,_xlfn.RANK.EQ(V172,V$171:V$174),0)","v":0},{"$f":"F172+H172+J172+L172+N172+P172+R172+T172","v":0},null,{"$f":"X171+1","v":2},{"$f":"IF(OR(E172=\"\",E172=\"DNS\",E172=\"DNF\"),0,_xlfn.RANK.EQ(E172,E$171:E$174,1))","v":0},{"$f":"IF(OR(G172=\"\",G172=\"DNS\",G172=\"DNF\"),0,_xlfn.RANK.EQ(G172,G$171:G$174,1))","v":0},{"$f":"IF(OR(I172=\"\",I172=\"DNS\",I172=\"DNF\"),0,_xlfn.RANK.EQ(I172,I$171:I$174,1))","v":0},{"$f":"IF(OR(K172=\"\",K172=\"DNS\",K172=\"DNF\"),0,_xlfn.RANK.EQ(K172,K$171:K$181,1))","v":0},{"$f":"IF(OR(M172=\"\",M172=\"DNS\",M172=\"DNF\"),0,_xlfn.RANK.EQ(M172,M$171:M$181,1))","v":0},{"$f":"IF(OR(O172=\"\",O172=\"DNS\",O172=\"DNF\"),0,_xlfn.RANK.EQ(O172,O$171:O$181,1))","v":0},{"$f":"IF(OR(Q172=\"\",Q172=\"DNS\",Q172=\"DNF\"),0,_xlfn.RANK.EQ(Q172,Q$171:Q$181,1))","v":0},{"$f":"IF(OR(S172=\"\",S172=\"DNS\",S172=\"DNF\"),0,_xlfn.RANK.EQ(S172,S$171:S$181,1))","v":0}]
[null,null,null,null,null,null,null,null,null,null,null,null,null,null,null,null,null,null,null,null,{"$f":"IF(V173>0,_xlfn.RANK.EQ(V173,V$171:V$174),0)","v":0},{"$f":"F173+H173+J173+L173+N173+P173+R173+T173","v":0},null,3,0,0,0,{"$f":"IF(OR(K173=\"\",K173=\"DNS\",K173=\"DNF\"),0,_xlfn.RANK.EQ(K173,K$171:K$181,1))","v":0},{"$f":"IF(OR(M173=\"\",M173=\"DNS\",M173=\"DNF\"),0,_xlfn.RANK.EQ(M173,M$171:M$181,1))","v":0},{"$f":"IF(OR(O173=\"\",O173=\"DNS\",O173=\"DNF\"),0,_xlfn.RANK.EQ(O173,O$171:O$181,1))","v":0},{"$f":"IF(OR(Q173=\"\",Q173=\"DNS\",Q173=\"DNF\"),0,_xlfn.RANK.EQ(Q173,Q$171:Q$181,1))","v":0},{"$f":"IF(OR(S173=\"\",S173=\"DNS\",S173=\"DNF\"),0,_xlfn.RANK.EQ(S173,S$171:S$181,1))","v":0}]
[null,null,null,null,null,{"$f":"IF($Y174=0,0,VLOOKUP($Y174,Rangeringskalkulator,2,FALSE))","v":0},null,{"$f":"IF($Z174=0,0,VLOOKUP($Z174,Rangeringskalkulator,2,FALSE))","v":0},null,{"$f":"IF($AA174=0,0,VLOOKUP($AA174,Rangeringskalkulator,2,FALSE))","v":0},null,{"$f":"IF($AB174=0,0,VLOOKUP($AB174,Rangeringskalkulator,2,FALSE))","v":0},null,{"$f":"IF($AC174=0,0,VLOOKUP($AC174,Rangeringskalkulator,2,FALSE))","v":0},null,{"$f":"IF($AD174=0,0,VLOOKUP($AD174,Rangeringskalkulator,2,FALSE))","v":0},null,{"$f":"IF($AE174=0,0,VLOOKUP($AE174,Rangeringskalkulator,2,FALSE))","v":0},null,{"$f":"IF($AF174=0,0,VLOOKUP($AF174,Rangeringskalkulator,2,FALSE))","v":0},{"$f":"IF(V174>0,_xlfn.RANK.EQ(V174,V$171:V$174),0)","v":0},{"$f":"F174+H174+J174+L174+N174+P174+R174+T174","v":0},null,4,0,0,0,{"$f":"IF(OR(K174=\"\",K174=\"DNS\",K174=\"DNF\"),0,_xlfn.RANK.EQ(K174,K$171:K$181,1))","v":0},{"$f":"IF(OR(M174=\"\",M174=\"DNS\",M174=\"DNF\"),0,_xlfn.RANK.EQ(M174,M$171:M$181,1))","v":0},{"$f":"IF(OR(O174=\"\",O174=\"DNS\",O174=\"DNF\"),0,_xlfn.RANK.EQ(O174,O$171:O$181,1))","v":0},{"$f":"IF(OR(Q174=\"\",Q174=\"DNS\",Q174=\"DNF\"),0,_xlfn.RANK.EQ(Q174,Q$171:Q$181,1))","v":0},{"$f":"IF(OR(S174=\"\",S174=\"DNS\",S174=\"DNF\"),0,_xlfn.RANK.EQ(S174,S$171:S$181,1))","v":0}]
[]
["M Junior",null,null,null,{"$f":"E$5","v":"2025-04-22"},null,{"$f":"G$5","v":"2025-05-06"},null,{"$f":"I$5","v":"2025-05-13"},null,{"$f":"K$5","v":"2025-05-27"},null,{"$f":"M$5","v":"2025-06-10"},null,{"$f":"O$5","v":"2025-08-12"},null,{"$f":"Q$5","v":"2025-08-26"},null,{"$f":"S$5","v":"2025-09-16"},null,"RANK",null,null,"Hjelpeceller"]
["Start nr","Etternavn","Fornavn","Klubb","Tid","poeng","Tid","poeng","Tid","poeng","Tid","poeng","Tid","poeng","Tid","poeng","Tid","poeng","Tid","poeng","PLASS","POENG",null,"Teller",{"$f":"$E$5","v":"2025-04-22"},{"$f":"$G$5","v":"2025-05-06"},{"$f":"$I$5","v":"2025-05-13"},{"$f":"$K$5","v":"2025-05-27"},{"$f":"$M$5","v":"2025-06-10"},{"$f":"$O$5","v":"2025-08-12"},{"$f":"$Q$5","v":"2025-08-26"},{"$f":"$S$5","v":"2025-09-16"},{"$f":"V52","v":"00:00:00"}]
[null,null,null,null,null,null,null,null,null,null,null,null,null,null,null,null,null,null,null,null,{"$f":"IF(V178>0,_xlfn.RANK.EQ(V178,V$178:V$181),0)","v":0},{"$f":"F178+H178+J178+L178+N178+P178+R178+T178","v":0},null,1,{"$f":"IF(OR(E178=\"\",E178=\"DNS\",E178=\"DNF\"),0,_xlfn.RANK.EQ(E178,E$178:E$181,1))","v":0},{"$f":"IF(OR(G178=\"\",G178=\"DNS\",G178=\"DNF\"),0,_xlfn.RANK.EQ(G178,G$178:G$181,1))","v":0},{"$f":"IF(OR(I178=\"\",I178=\"DNS\",I178=\"DNF\"),0,_xlfn.RANK.EQ(I178,I$178:I$181,1))","v":0},{"$f":"IF(OR(K178=\"\",K178=\"DNS\",K178=\"DNF\"),0,_xlfn.RANK.EQ(K178,K$178:K$181,1))","v":0},{"$f":"IF(OR(M178=\"\",M178=\"DNS\",M178=\"DNF\"),0,_xlfn.RANK.EQ(M178,M$178:M$181,1))","v":0},{"$f":"IF(OR(O178=\"\",O178=\"DNS\",O178=\"DNF\"),0,_xlfn.RANK.EQ(O178,O$178:O$181,1))","v":0},{"$f":"IF(OR(Q178=\"\",Q178=\"DNS\",Q178=\"DNF\"),0,_xlfn.RANK.EQ(Q178,Q$178:Q$181,1))","v":0},{"$f":"IF(OR(S178=\"\",S178=\"DNS\",S178=\"DNF\"),0,_xlfn.RANK.EQ(S178,S$178:S$181,1))","v":0}]
[null,null,null,null,null,null,null,null,null,null,null,null,null,null,null,null,null,{"$f":"IF($AE179=0,0,VLOOKUP($AE179,Rangeringskalkulator,2,FALSE))","v":0},null,{"$f":"IF($AF179=0,0,VLOOKUP($AF179,Rangeringskalkulator,2,FALSE))","v":0},{"$f":"IF(V179>0,_xlfn.RANK.EQ(V179,V$178:V$181),0)","v":0},{"$f":"F179+H179+J179+L179+N179+P179+R179+T179","v":0},null,{"$f":"X178+1","v":2},{"$f":"IF(OR(E179=\"\",E179=\"DNS\",E179=\"DNF\"),0,_xlfn.RANK.EQ(E179,E$178:E$181,1))","v":0},{"$f":"IF(OR(G179=\"\",G179=\"DNS\",G179=\"DNF\"),0,_xlfn.RANK.EQ(G179,G$178:G$181,1))","v":0},{"$f":"IF(OR(I179=\"\",I179=\"DNS\",I179=\"DNF\"),0,_xlfn.RANK.EQ(I179,I$178:I$181,1))","v":0},{"$f":"IF(OR(K179=\"\",K179=\"DNS\",K179=\"DNF\"),0,_xlfn.RANK.EQ(K179,K$178:K$181,1))","v":0},{"$f":"IF(OR(M179=\"\",M179=\"DNS\",M179=\"DNF\"),0,_xlfn.RANK.EQ(M179,M$178:M$181,1))","v":0},{"$f":"IF(OR(O179=\"\",O179=\"DNS\",O179=\"DNF\"),0,_xlfn.RANK.EQ(O179,O$178:O$181,1))","v":0},{"$f":"IF(OR(Q179=\"\",Q179=\"DNS\",Q179=\"DNF\"),0,_xlfn.RANK.EQ(Q179,Q$178:Q$181,1))","v":0},{"$f":"IF(OR(S179=\"\",S179=\"DNS\",S179=\"DNF\"),0,_xlfn.RANK.EQ(S179,S$178:S$181,1))","v":0}]
[null,null,null,null,null,null,null,null,null,null,null,null,null,null,null,null,null,{"$f":"IF($AE180=0,0,VLOOKUP($AE180,Rangeringskalkulator,2,FALSE))","v":0},null,{"$f":"IF($AF180=0,0,VLOOKUP($AF180,Rangeringskalkulator,2,FALSE))","v":0},{"$f":"IF(V180>0,_xlfn.RANK.EQ(V180,V$178:V$181),0)","v":0},{"$f":"F180+H180+J180+L180+N180+P180+R180+T180","v":0},null,{"$f":"X178+1","v":2},{"$f":"IF(OR(E180=\"\",E180=\"DNS\",E180=\"DNF\"),0,_xlfn.RANK.EQ(E180,E$178:E$181,1))","v":0},{"$f":"IF(OR(G180=\"\",G180=\"DNS\",G180=\"DNF\"),0,_xlfn.RANK.EQ(G180,G$178:G$181,1))","v":0},{"$f":"IF(OR(I180=\"\",I180=\"DNS\",I180=\"DNF\"),0,_xlfn.RANK.EQ(I180,I$178:I$181,1))","v":0},{"$f":"IF(OR(K180=\"\",K180=\"DNS\",K180=\"DNF\"),0,_xlfn.RANK.EQ(K180,K$178:K$181,1))","v":0},{"$f":"IF(OR(M180=\"\",M180=\"DNS\",M180=\"DNF\"),0,_xlfn.RANK.EQ(M180,M$178:M$181,1))","v":0},{"$f":"IF(OR(O180=\"\",O180=\"DNS\",O180=\"DNF\"),0,_xlfn.RANK.EQ(O180,O$178:O$181,1))","v":0},{"$f":"IF(OR(Q180=\"\",Q180=\"DNS\",Q180=\"DNF\"),0,_xlfn.RANK.EQ(Q180,Q$178:Q$181,1))","v":0},{"$f":"IF(OR(S180=\"\",S180=\"DNS\",S180=\"DNF\"),0,_xlfn.RANK.EQ(S180,S$178:S$181,1))","v":0}]
[null,null,null,null,null,null,null,null,null,null,null,null,null,null,null,null,null,{"$f":"IF($AE181=0,0,VLOOKUP($AE181,Rangeringskalkulator,2,FALSE))","v":0},null,{"$f":"IF($AF181=0,0,VLOOKUP($AF181,Rangeringskalkulator,2,FALSE))","v":0},{"$f":"IF(V181>0,_xlfn.RANK.EQ(V181,V$178:V$181),0)","v":0},{"$f":"F181+H181+J181+L181+N181+P181+R181+T181","v":0},null,{"$f":"X179+1","v":3},{"$f":"IF(OR(E181=\"\",E181=\"DNS\",E181=\"DNF\"),0,_xlfn.RANK.EQ(E181,E$178:E$181,1))","v":0},{"$f":"IF(OR(G181=\"\",G181=\"DNS\",G181=\"DNF\"),0,_xlfn.RANK.EQ(G181,G$178:G$181,1))","v":0},{"$f":"IF(OR(I181=\"\",I181=\"DNS\",I181=\"DNF\"),0,_xlfn.RANK.EQ(I181,I$178:I$181,1))","v":0},{"$f":"IF(OR(K181=\"\",K181=\"DNS\",K181=\"DNF\"),0,_xlfn.RANK.EQ(K181,K$178:K$181,1))","v":0},{"$f":"IF(OR(M181=\"\",M181=\"DNS\",M181=\"DNF\"),0,_xlfn.RANK.EQ(M181,M$178:M$181,1))","v":0},{"$f":"IF(OR(O181=\"\",O181=\"DNS\",O181=\"DNF\"),0,_xlfn.RANK.EQ(O181,O$178:O$181,1))","v":0},{"$f":"IF(OR(Q181=\"\",Q181=\"DNS\",Q181=\"DNF\"),0,_xlfn.RANK.EQ(Q181,Q$178:Q$181,1))","v":0},{"$f":"IF(OR(S181=\"\",S181=\"DNS\",S181=\"DNF\"),0,_xlfn.RANK.EQ(S181,S$178:S$181,1))","v":0}]
[]
[]
["K Junior",null,null,null,{"$f":"E$5","v":"2025-04-22"},null,{"$f":"G$5","v":"2025-05-06"},null,{"$f":"I$5","v":"2025-05-13"},null,{"$f":"K$5","v":"2025-05-27"},null,{"$f":"M$5","v":"2025-06-10"},null,{"$f":"O$5","v":"2025-08-12"},null,{"$f":"Q$5","v":"2025-08-26"},null,{"$f":"S$5","v":"2025-09-16"},null,"RANK",null,null,"Hjelpeceller"]
["Start nr","Etternavn","Fornavn","Klubb","Tid","poeng","Tid","poeng","Tid","poeng","Tid","poeng","Tid","poeng","Tid","poeng","Tid","poeng","Tid","poeng","PLASS","POENG",null,"Teller",{"$f":"$E$5","v":"2025-04-22"},{"$f":"$G$5","v":"2025-05-06"},{"$f":"$I$5","v":"2025-05-13"},{"$f":"$K$5","v":"2025-05-27"},{"$f":"$M$5","v":"2025-06-10"},{"$f":"$O$5","v":"2025-08-12"},{"$f":"$Q$5","v":"2025-08-26"},{"$f":"$S$5","v":"2025-09-16"}]
[null,null,null,null,null,null,null,null,null,null,null,null,null,null,null,null,null,{"$f":"IF($AE186=0,0,VLOOKUP($AE186,Rangeringskalkulator,2,FALSE))","v":0},null,{"$f":"IF($AF186=0,0,VLOOKUP($AF186,Rangeringskalkulator,2,FALSE))","v":0},{"$f":"IF(V186>0,_xlfn.RANK.EQ(V186,V$186:V$187),0)","v":0},{"$f":"F186+H186+J186+L186+N186+P186+R186+T186","v":0},null,1,{"$f":"IF(OR(E186=\"\",E186=\"DNS\",E186=\"DNF\"),0,_xlfn.RANK.EQ(E186,E$186:E$187,1))","v":0},{"$f":"IF(OR(G186=\"\",G186=\"DNS\",G186=\"DNF\"),0,_xlfn.RANK.EQ(G186,G$186:G$187,1))","v":0},{"$f":"IF(OR(I186=\"\",I186=\"DNS\",I186=\"DNF\"),0,_xlfn.RANK.EQ(I186,I$186:I$187,1))","v":0},{"$f":"IF(OR(K186=\"\",K186=\"DNS\",K186=\"DNF\"),0,_xlfn.RANK.EQ(K186,K$186:K$187,1))","v":0},{"$f":"IF(OR(M186=\"\",M186=\"DNS\",M186=\"DNF\"),0,_xlfn.RANK.EQ(M186,M$186:M$187,1))","v":0},{"$f":"IF(OR(O186=\"\",O186=\"DNS\",O186=\"DNF\"),0,_xlfn.RANK.EQ(O186,O$186:O$187,1))","v":0},{"$f":"IF(OR(Q186=\"\",Q186=\"DNS\",Q186=\"DNF\"),0,_xlfn.RANK.EQ(Q186,Q$186:Q$187,1))","v":0},{"$f":"IF(OR(S186=\"\",S186=\"DNS\",S186=\"DNF\"),0,_xlfn.RANK.EQ(S186,S$186:S$187,1))","v":0}]
[null,null,null,null,null,{"$f":"IF($Y187=0,0,VLOOKUP($Y187,Rangeringskalkulator,2,FALSE))","v":0},null,{"$f":"IF($Z187=0,0,VLOOKUP($Z187,Rangeringskalkulator,2,FALSE))","v":0},null,{"$f":"IF($AA187=0,0,VLOOKUP($AA187,Rangeringskalkulator,2,FALSE))","v":0},null,{"$f":"IF($AB187=0,0,VLOOKUP($AB187,Rangeringskalkulator,2,FALSE))","v":0},null,{"$f":"IF($AC187=0,0,VLOOKUP($AC187,Rangeringskalkulator,2,FALSE))","v":0},null,{"$f":"IF($AD187=0,0,VLOOKUP($AD187,Rangeringskalkulator,2,FALSE))","v":0},null,{"$f":"IF($AE187=0,0,VLOOKUP($AE187,Rangeringskalkulator,2,FALSE))","v":0},null,{"$f":"IF($AF187=0,0,VLOOKUP($AF187,Rangeringskalkulator,2,FALSE))","v":0},{"$f":"IF(V187>0,_xlfn.RANK.EQ(V187,V$186:V$187),0)","v":0},{"$f":"F187+H187+J187+L187+N187+P187+R187+T187","v":0},null,{"$f":"X186+1","v":2},{"$f":"IF(OR(E187=\"\",E187=\"DNS\",E187=\"DNF\"),0,_xlfn.RANK.EQ(E187,E$186:E$187,1))","v":0},{"$f":"IF(OR(G187=\"\",G187=\"DNS\",G187=\"DNF\"),0,_xlfn.RANK.EQ(G187,G$186:G$187,1))","v":0},{"$f":"IF(OR(I187=\"\",I187=\"DNS\",I187=\"DNF\"),0,_xlfn.RANK.EQ(I187,I$186:I$187,1))","v":0},{"$f":"IF(OR(K187=\"\",K187=\"DNS\",K187=\"DNF\"),0,_xlfn.RANK.EQ(K187,K$186:K$187,1))","v":0},{"$f":"IF(OR(M187=\"\",M187=\"DNS\",M187=\"DNF\"),0,_xlfn.RANK.EQ(M187,M$186:M$187,1))","v":0},{"$f":"IF(OR(O187=\"\",O187=\"DNS\",O187=\"DNF\"),0,_xlfn.RANK.EQ(O187,O$186:O$187,1))","v":0},{"$f":"IF(OR(Q187=\"\",Q187=\"DNS\",Q187=\"DNF\"),0,_xlfn.RANK.EQ(Q187,Q$186:Q$187,1))","v":0},{"$f":"IF(OR(S187=\"\",S187=\"DNS\",S187=\"DNF\"),0,_xlfn.RANK.EQ(S187,S$186:S$187,1))","v":0}]
[]
["M Senior",null,null,null,{"$f":"E$5","v":"2025-04-22"},null,{"$f":"G$5","v":"2025-05-06"},null,{"$f":"I$5","v":"2025-05-13"},null,{"$f":"K$5","v":"2025-05-27"},null,{"$f":"M$5","v":"2025-06-10"},null,{"$f":"O$5","v":"2025-08-12"},null,{"$f":"Q$5","v":"2025-08-26"},null,{"$f":"S$5","v":"2025-09-16"},null,"RANK",null,null,"Hjelpeceller"]
["Start nr","Etternavn","Fornavn","Klubb","Tid","poeng","Tid","poeng","Tid","poeng","Tid","poeng","Tid","poeng","Tid","poeng","Tid","poeng","Tid","poeng","PLASS","POENG",null,"Teller",{"$f":"$E$5","v":"2025-04-22"},{"$f":"$G$5","v":"2025-05-06"},{"$f":"$I$5","v":"2025-05-13"},{"$f":"$K$5","v":"2025-05-27"},{"$f":"$M$5","v":"2025-06-10"},{"$f":"$O$5","v":"2025-08-12"},{"$f":"$Q$5","v":"2025-08-26"},{"$f":"$S$5","v":"2025-09-16"},{"$f":"V56","v":"00:00:00"}]
[510,"Tregde","Vidar","Mandal CK","DNS",null,"00:36:31",4,null,null,null,null,"00:41:38",4,null,null,"00:37:56",7,"DNF",null,{"$f":"IF(V191>0,_xlfn.RANK.EQ(V191,V$191:V$223),0)","v":10},{"$f":"F191+H191+J191+L191+N191+P191+R191+T191","v":15},null,1,{"$f":"IF(OR(E191=\"\",E191=\"DNS\",E191=\"DNF\"),0,_xlfn.RANK.EQ(E191,E$191:E$223,1))","v":0},{"$f":"IF(OR(G191=\"\",G191=\"DNS\",G191=\"DNF\"),0,_xlfn.RANK.EQ(G191,G$191:G$223,1))","v":6},{"$f":"IF(OR(I191=\"\",I191=\"DNS\",I191=\"DNF\"),0,_xlfn.RANK.EQ(I191,I$191:I$223,1))","v":0},{"$f":"IF(OR(K191=\"\",K191=\"DNS\",K191=\"DNF\"),0,_xlfn.RANK.EQ(K191,K$191:K$223,1))","v":0},{"$f":"IF(OR(M191=\"\",M191=\"DNS\",M191=\"DNF\"),0,_xlfn.RANK.EQ(M191,M$191:M$223,1))","v":6},{"$f":"IF(OR(O191=\"\",O191=\"DNS\",O191=\"DNF\"),0,_xlfn.RANK.EQ(O191,O$191:O$223,1))","v":0},{"$f":"IF(OR(Q191=\"\",Q191=\"DNS\",Q191=\"DNF\"),0,_xlfn.RANK.EQ(Q191,Q$191:Q$223,1))","v":3},{"$f":"IF(OR(S191=\"\",S191=\"DNS\",S191=\"DNF\"),0,_xlfn.RANK.EQ(S191,S$191:S$223,1))","v":0}]
[516,"Aanensen","Bjørn Kjetil","Sola CK","00:40:40",7,null,null,"00:34:27",6,"00:35:46",5,"00:36:47",5,null,null,null,null,"00:37:46",6,4,29,null,{"$f":"X191+1","v":2},3,0,4,5,5,0,0,4]
[549,"Aanensen","Joakim","Kristiansands CK","00:32:45",10,"00:30:28",10,"00:29:10",10,"00:30:19",10,"00:30:49",10,null,null,"00:31:27",10,"00:31:40",10,1,70,null,3,1,1,1,1,1,0,1,1]
[520,"Lohne","Håkon","Lund CK","00:39:35",8,null,null,null,null,"00:33:10",7,"00:34:36",7,null,null,null,null,null,null,6,22,null,4,2,0,0,3,3,0,0,0]
[521,"Lohne","Asbjørn","Kristiansands CK",null,null,"00:31:11",8,null,null,null,null,null,null,"00:31:38",10,null,null,"00:32:46",8,5,26,null,5,0,2,0,0,0,1,0,2]
[522,"Søvik","Børge","Lund CK",null,null,"00:32:14",6,null,null,null,null,null,null,null,null,null,null,null,null,12,6,null,6,0,4,0,0,0,0,0,0]
[523,"Langeland","Preben","Kristiansands CK",null,null,"00:40:07",2,"00:39:07",5,"00:42:32",3,null,null,"00:40:37",7,null,null,"00:43:10",5,6,22,null,7,0,8,5,7,0,3,0,5]
[524,"Ellingsæter","Sverre Stusvik","Mandal CK",null,null,null,null,null,null,null,null,null,null,null,null,null,null,null,null,0,0,null,8,0,0,0,0,0,0,0,0]
[525,"Helgestad","Rolf","Mandal CK",null,null,"00:40:47",1,"00:41:38",4,"00:43:16",1,null,null,"00:42:05",6,"00:40:25",6,"00:44:02",4,6,22,null,9,0,9,6,9,0,4,4,6]
[526,"Schanke","Rolf Sverre","Blindleia CK",null,null,"00:36:42",3,null,null,null,null,null,null,null,null,null,null,null,null,15,3,null,10,0,7,0,0,0,0,0,0]
[527,"Kaino","Per Richard","Arendal CC",null,null,"00:33:44",5,null,null,null,null,null,null,null,null,null,null,null,null,13,5,null,11,0,5,0,0,0,0,0,0]
[528,"Eidesund","Arild","Blindleia CK",null,null,"00:49:11",1,null,null,null,null,null,null,null,null,null,null,null,null,16,1,null,12,0,10,0,0,0,0,0,0]
[529,"Langeland","Mads","Kristiansands CK",null,null,"00:31:28",7,"00:30:10",8,"00:31:28",8,"00:34:12",8,null,null,null,null,null,null,3,31,null,13,0,3,2,2,2,0,0,0]
[530,"Simonsen","Simon Andre","Mandal CK",null,null,null,null,"00:44:37",3,"00:43:13",2,null,null,"00:43:59",5,"00:42:47",5,"00:49:45",3,9,18,null,14,0,0,7,8,0,5,5,7]
[531,"Sefland","Håvard","Kristiansands CK",null,null,null,null,"00:31:32",7,"00:34:02",6,"00:35:23",6,null,null,"00:31:28",8,"00:35:42",7,2,34,null,15,0,0,3,4,4,0,2,3]
[532,"Schnabel","Jonas","Pulheimer SC",null,null,null,null,null,null,"00:41:50",4,null,null,null,null,null,null,null,null,14,4,null,16,0,0,0,6,0,0,0,0]
[533,"Kvidbergskår","Arne","Mandal CK",null,null,null,null,null,null,null,null,null,null,null,null,null,null,null,{"$f":"IF($AF207=0,0,VLOOKUP($AF207,Rangeringskalkulator,2,FALSE))","v":0},0,0,null,17,0,0,0,0,0,0,0,0]
[534,"Sklett Larsen","Kristian","Kristiansands CK",null,null,null,null,null,null,null,null,null,null,null,null,null,null,null,0,0,0,null,18,0,0,0,0,0,0,0,0]
[535,"Natvig","Ronnie","Kristiansands CK",null,null,null,null,null,null,null,null,null,null,"00:36:33",8,null,null,null,0,11,8,null,19,0,0,0,0,0,2,0,0]
[536,"Lyding","Philip","Kristiansands CK",null,{"$f":"IF($Y210=0,0,VLOOKUP($Y210,Rangeringskalkulator,2,FALSE))","v":0},null,{"$f":"IF($Z210=0,0,VLOOKUP($Z210,Rangeringskalkulator,2,FALSE))","v":0},null,{"$f":"IF($AA210=0,0,VLOOKUP($AA210,Rangeringskalkulator,2,FALSE))","v":0},null,{"$f":"IF($AB210=0,0,VLOOKUP($AB210,Rangeringskalkulator,2,FALSE))","v":0},null,{"$f":"IF($AC210=0,0,VLOOKUP($AC210,Rangeringskalkulator,2,FALSE))","v":0},null,{"$f":"IF($AD210=0,0,VLOOKUP($AD210,Rangeringskalkulator,2,FALSE))","v":0},null,{"$f":"IF($AE210=0,0,VLOOKUP($AE210,Rangeringskalkulator,2,FALSE))","v":0},null,0,0,0,null,20,0,0,0,0,0,0,0,0]
[null,null,null,null,null,0,null,0,null,0,null,0,null,0,null,0,null,0,null,0,0,0,null,21,0,0,0,0,0,0,0,0]
[null,null,null,null,null,0,null,0,null,0,null,0,null,0,null,0,null,0,null,0,0,0,null,22,0,0,0,0,0,0,0,0]
[null,null,null,null,null,0,null,0,null,0,null,0,null,0,null,0,null,0,null,0,0,0,null,23,0,0,0,0,0,0,0,0]
[null,null,null,null,null,0,null,0,null,{"$f":"IF($AA214=0,0,VLOOKUP($AA214,Rangeringskalkulator,2,FALSE))","v":0},null,null,null,null,null,null,null,null,null,null,0,0,null,24,0,0,0,0,0,0,0,0]
[null,null,null,null,null,0,null,0,null,0,null,{"$f":"IF($AB215=0,0,VLOOKUP($AB215,Rangeringskalkulator,2,FALSE))","v":0},null,{"$f":"IF($AC215=0,0,VLOOKUP($AC215,Rangeringskalkulator,2,FALSE))","v":0},null,{"$f":"IF($AD215=0,0,VLOOKUP($AD215,Rangeringskalkulator,2,FALSE))","v":0},null,{"$f":"IF($AE215=0,0,VLOOKUP($AE215,Rangeringskalkulator,2,FALSE))","v":0},null,{"$f":"IF($AF215=0,0,VLOOKUP($AF215,Rangeringskalkulator,2,FALSE))","v":0},0,0,null,25,{"$f":"IF(OR(E215=\"\",E215=\"DNS\",E215=\"DNF\"),0,_xlfn.RANK.EQ(E215,E$191:E$223,1))","v":0},{"$f":"IF(OR(G215=\"\",G215=\"DNS\",G215=\"DNF\"),0,_xlfn.RANK.EQ(G215,G$191:G$223,1))","v":0},{"$f":"IF(OR(I215=\"\",I215=\"DNS\",I215=\"DNF\"),0,_xlfn.RANK.EQ(I215,I$191:I$223,1))","v":0},{"$f":"IF(OR(K215=\"\",K215=\"DNS\",K215=\"DNF\"),0,_xlfn.RANK.EQ(K215,K$191:K$223,1))","v":0},{"$f":"IF(OR(M215=\"\",M215=\"DNS\",M215=\"DNF\"),0,_xlfn.RANK.EQ(M215,M$191:M$223,1))","v":0},{"$f":"IF(OR(O215=\"\",O215=\"DNS\",O215=\"DNF\"),0,_xlfn.RANK.EQ(O215,O$191:O$223,1))","v":0},{"$f":"IF(OR(Q215=\"\",Q215=\"DNS\",Q215=\"DNF\"),0,_xlfn.RANK.EQ(Q215,Q$191:Q$223,1))","v":0},{"$f":"IF(OR(S215=\"\",S215=\"DNS\",S215=\"DNF\"),0,_xlfn.RANK.EQ(S215,S$191:S$223,1))","v":0}]
[null,null,null,null,null,0,null,0,null,0,null,null,null,null,null,null,null,null,null,null,0,0,null,26,0,0,0,0,0,0,0,0]
[null,null,null,null,null,0,null,0,null,0,null,null,null,null,null,null,null,null,null,null,0,0,null,27,0,0,0,0,0,0,0,0]
[null,null,null,null,null,0,null,0,null,0,null,null,null,null,null,null,null,null,null,null,0,0,null,28,0,0,0,0,0,0,0,0]
[null,null,null,null,null,0,null,0,null,0,null,null,null,null,null,null,null,null,null,null,0,0,null,29,0,0,0,0,0,0,0,0]
[null,null,null,null,null,0,null,0,null,0,null,null,null,null,null,null,null,null,null,null,0,0,null,30,0,0,0,0,0,0,0,0]
[null,null,null,null,null,0,null,0,null,0,null,null,null,null,null,null,null,null,null,null,0,0,null,31,0,0,0,0,0,0,0,0]
[null,null,null,null,null,0,null,0,null,0,null,null,null,null,null,null,null,null,null,null,0,0,null,32,0,0,0,0,0,0,0,0]
[null,null,null,null,null,0,null,0,null,0,null,null,null,null,null,null,null,null,null,null,0,0,null,33,0,0,0,0,0,0,0,0]
[]
["K Senior",null,null,null,{"$f":"E$5","v":"2025-04-22"},null,{"$f":"G$5","v":"2025-05-06"},null,{"$f":"I$5","v":"2025-05-13"},null,{"$f":"K$5","v":"2025-05-27"},null,{"$f":"M$5","v":"2025-06-10"},null,{"$f":"O$5","v":"2025-08-12"},null,{"$f":"Q$5","v":"2025-08-26"},null,{"$f":"S$5","v":"2025-09-16"},null,"RANK",null,null,"Hjelpeceller"]
["Start nr","Etternavn","Fornavn","Klubb","Tid","poeng","Tid","poeng","Tid","poeng","Tid","poeng","Tid","poeng","Tid","poeng","Tid","poeng","Tid","poeng","PLASS","POENG",null,"Teller",{"$f":"$E$5","v":"2025-04-22"},{"$f":"$G$5","v":"2025-05-06"},{"$f":"$I$5","v":"2025-05-13"},{"$f":"$K$5","v":"2025-05-27"},{"$f":"$M$5","v":"2025-06-10"},{"$f":"$O$5","v":"2025-08-12"},{"$f":"$Q$5","v":"2025-08-26"},{"$f":"$S$5","v":"2025-09-16"},{"$f":"V82","v":"00:00:00"}]
[431,"Eigebrekk","Linn","Mandal CK","00:45:55",10,null,null,null,null,null,null,null,null,null,null,null,null,null,null,{"$f":"IF(V227>0,_xlfn.RANK.EQ(V227,V$227:V$227),0)","v":1},{"$f":"F227+H227+J227+L227+N227+P227+R227+T227","v":10},null,1,{"$f":"IF(OR(E227=\"\",E227=\"DNS\",E227=\"DNF\"),0,_xlfn.RANK.EQ(E227,E$227:E$229,1))","v":1},{"$f":"IF(OR(G227=\"\",G227=\"DNS\",G227=\"DNF\"),0,_xlfn.RANK.EQ(G227,G$227:G$229,1))","v":0},{"$f":"IF(OR(I227=\"\",I227=\"DNS\",I227=\"DNF\"),0,_xlfn.RANK.EQ(I227,I$227:I$229,1))","v":0},{"$f":"IF(OR(K227=\"\",K227=\"DNS\",K227=\"DNF\"),0,_xlfn.RANK.EQ(K227,K$227:K$229,1))","v":0},{"$f":"IF(OR(M227=\"\",M227=\"DNS\",M227=\"DNF\"),0,_xlfn.RANK.EQ(M227,M$227:M$229,1))","v":0},{"$f":"IF(OR(O227=\"\",O227=\"DNS\",O227=\"DNF\"),0,_xlfn.RANK.EQ(O227,O$227:O$229,1))","v":0},{"$f":"IF(OR(Q227=\"\",Q227=\"DNS\",Q227=\"DNF\"),0,_xlfn.RANK.EQ(Q227,Q$227:Q$229,1))","v":0},{"$f":"IF(OR(S227=\"\",S227=\"DNS\",S227=\"DNF\"),0,_xlfn.RANK.EQ(S227,S$227:S$229,1))","v":0}]
[null,null,null,null,null,{"$f":"IF($Y228=0,0,VLOOKUP($Y228,Rangeringskalkulator,2,FALSE))","v":0},null,{"$f":"IF($Z228=0,0,VLOOKUP($Z228,Rangeringskalkulator,2,FALSE))","v":0},null,{"$f":"IF($AA228=0,0,VLOOKUP($AA228,Rangeringskalkulator,2,FALSE))","v":0},null,{"$f":"IF($AB228=0,0,VLOOKUP($AB228,Rangeringskalkulator,2,FALSE))","v":0},null,{"$f":"IF($AC228=0,0,VLOOKUP($AC228,Rangeringskalkulator,2,FALSE))","v":0},null,{"$f":"IF($AD228=0,0,VLOOKUP($AD228,Rangeringskalkulator,2,FALSE))","v":0},null,{"$f":"IF($AE228=0,0,VLOOKUP($AE228,Rangeringskalkulator,2,FALSE))","v":0},null,{"$f":"IF($AF228=0,0,VLOOKUP($AF228,Rangeringskalkulator,2,FALSE))","v":0},{"$f":"IF(V228>0,_xlfn.RANK.EQ(V228,V$227:V$229),0)","v":0},{"$f":"F228+H228+J228+L228+N228+P228+R228+T228","v":0},null,{"$f":"X227+1","v":2},{"$f":"IF(OR(E228=\"\",E228=\"DNS\",E228=\"DNF\"),0,_xlfn.RANK.EQ(E228,E$227:E$229,1))","v":0},{"$f":"IF(OR(G228=\"\",G228=\"DNS\",G228=\"DNF\"),0,_xlfn.RANK.EQ(G228,G$227:G$229,1))","v":0},{"$f":"IF(OR(I228=\"\",I228=\"DNS\",I228=\"DNF\"),0,_xlfn.RANK.EQ(I228,I$227:I$229,1))","v":0},{"$f":"IF(OR(K228=\"\",K228=\"DNS\",K228=\"DNF\"),0,_xlfn.RANK.EQ(K228,K$227:K$229,1))","v":0},{"$f":"IF(OR(M228=\"\",M228=\"DNS\",M228=\"DNF\"),0,_xlfn.RANK.EQ(M228,M$227:M$229,1))","v":0},{"$f":"IF(OR(O228=\"\",O228=\"DNS\",O228=\"DNF\"),0,_xlfn.RANK.EQ(O228,O$227:O$229,1))","v":0},{"$f":"IF(OR(Q228=\"\",Q228=\"DNS\",Q228=\"DNF\"),0,_xlfn.RANK.EQ(Q228,Q$227:Q$229,1))","v":0},{"$f":"IF(OR(S228=\"\",S228=\"DNS\",S228=\"DNF\"),0,_xlfn.RANK.EQ(S228,S$227:S$229,1))","v":0}]
[null,null,null,null,null,{"$f":"IF($Y229=0,0,VLOOKUP($Y229,Rangeringskalkulator,2,FALSE))","v":0},null,{"$f":"IF($Z229=0,0,VLOOKUP($Z229,Rangeringskalkulator,2,FALSE))","v":0},null,{"$f":"IF($AA229=0,0,VLOOKUP($AA229,Rangeringskalkulator,2,FALSE))","v":0},null,{"$f":"IF($AB229=0,0,VLOOKUP($AB229,Rangeringskalkulator,2,FALSE))","v":0},null,{"$f":"IF($AC229=0,0,VLOOKUP($AC229,Rangeringskalkulator,2,FALSE))","v":0},null,{"$f":"IF($AD229=0,0,VLOOKUP($AD229,Rangeringskalkulator,2,FALSE))","v":0},null,{"$f":"IF($AE229=0,0,VLOOKUP($AE229,Rangeringskalkulator,2,FALSE))","v":0},null,{"$f":"IF($AF229=0,0,VLOOKUP($AF229,Rangeringskalkulator,2,FALSE))","v":0},{"$f":"IF(V229>0,_xlfn.RANK.EQ(V229,V$227:V$229),0)","v":0},{"$f":"F229+H229+J229+L229+N229+P229+R229+T229","v":0},null,3,{"$f":"IF(OR(E229=\"\",E229=\"DNS\",E229=\"DNF\"),0,_xlfn.RANK.EQ(E229,E$227:E$229,1))","v":0},{"$f":"IF(OR(G229=\"\",G229=\"DNS\",G229=\"DNF\"),0,_xlfn.RANK.EQ(G229,G$227:G$229,1))","v":0},{"$f":"IF(OR(I229=\"\",I229=\"DNS\",I229=\"DNF\"),0,_xlfn.RANK.EQ(I229,I$227:I$229,1))","v":0},{"$f":"IF(OR(K229=\"\",K229=\"DNS\",K229=\"DNF\"),0,_xlfn.RANK.EQ(K229,K$227:K$229,1))","v":0},{"$f":"IF(OR(M229=\"\",M229=\"DNS\",M229=\"DNF\"),0,_xlfn.RANK.EQ(M229,M$227:M$229,1))","v":0},{"$f":"IF(OR(O229=\"\",O229=\"DNS\",O229=\"DNF\"),0,_xlfn.RANK.EQ(O229,O$227:O$229,1))","v":0},{"$f":"IF(OR(Q229=\"\",Q229=\"DNS\",Q229=\"DNF\"),0,_xlfn.RANK.EQ(Q229,Q$227:Q$229,1))","v":0},{"$f":"IF(OR(S229=\"\",S229=\"DNS\",S229=\"DNF\"),0,_xlfn.RANK.EQ(S229,S$227:S$229,1))","v":0}]
[]
["RANGERING / PREMIERING"]
[]
["Klassene 6-9 og 10 rangeres ikke. Gjennomført ritt markeres i resultatlisten."]
["Klassen 11-12 rangeres ikke. Tid brukt oppgis i resultatlisten i vilkårlig rekkefølge."]
["Premiering i henhold til antall gjennomførte ritt som følger:"]
["Ritt 1 og 2: Bronse"]
["Ritt 3 og 4: Sølv"]
["Ritt 5 og 6: Gull"]
["7 eller 8 gjennomførte ritt: Pokal"]
[]
["Alle klasser fra 13 år rangeres i hvert ritt og sammenlagt:"]
["13-14 og 15-16:  1/3-premiering"]
["Jr og 20+: Gull, sølv, bronse"]
[]
["Deltakere må ha fullført minst 4 ritt i løpet av sesongen for premiering i sammenlagtkonkurransen."]
[]
["Alle ryttere får poeng i henhold til plassering som følger:"]
["1. plass: 10 poeng"]
["2. plass: 8 poeng"]
["3. plass: 7 poeng"]
["4. plass: 6 poeng"]
["5. plass: 5 poeng"]
["6. plass: 4 poeng"]
["7. plass: 3 poeng"]
["8. plass: 2 poeng"]
["9. plass og lavere: 1 poeng"]
["Brutt: 0 poeng"]
[]
["Arrangør: Kristiansands Cykleklubb"]
["Rittleder: "]

{"sheet":"Startliste P1","index":1,"n_rows":2,"n_cols":5,"rows_kept":2,"cut":false,"hidden":false,"merged":[]}
["  Pulje 1",null,null,null,"M/K 6-9  "]
["Start nr","Navn","Runder totalt","Kjørte runder","Resultat"]

{"sheet":"Startliste P2","index":2,"n_rows":2,"n_cols":5,"rows_kept":2,"cut":false,"hidden":false,"merged":[]}
["  Pulje 2",null,null,null,"M/K 10, 11-12"]
["Start nr","Navn","Runder totalt","Kjørte runder","Resultat"]

{"sheet":"Startliste P3","index":3,"n_rows":2,"n_cols":5,"rows_kept":2,"cut":false,"hidden":false,"merged":[]}
["  Pulje 3",null,null,null,"M/K13-14,M/K15-16, M/K17-19, M/K20-99"]
["Start nr","Navn","Runder totalt","Kjørte runder","Resultat"]

{"sheet":"Info","index":4,"n_rows":54,"n_cols":7,"rows_kept":54,"cut":false,"hidden":false,"merged":[]}
["Rangeringskalkulator",null,null,"Rittdatoer",null,"Medaljefordeling 6-12"]
["Plass","Poeng",null,"2019-05-07",null,"Ant deltatt","Valør"]
[1,10,null,"2019-05-21",null,1,"Bronse"]
[2,8,null,"2019-06-04",null,2,"Bronse"]
[3,7,null,"2019-06-18",null,3,"Sølv"]
[4,6,null,"2019-08-13",null,4,"Sølv"]
[5,5,null,"2019-08-27",null,5,"Gull"]
[6,4,null,"2019-09-10",null,6,"Gull"]
[7,3,null,"2019-09-24",null,7,"Pokal"]
[8,2,null,null,null,8,"Pokal"]
[9,1]
[10,1]
[11,1]
[12,1]
[13,1]
[14,1]
[15,1]
[16,1]
[17,1]
[18,1]
[19,1]
[20,1]
[21,1]
[22,1]
[23,1]
[24,1]
[25,1]
[26,1]
[27,1]
[28,1]
[29,1]
[30,1]
[31,1]
[32,1]
[33,1]
[34,1]
[35,1]
[36,1]
[37,1]
[38,1]
[39,1]
[40,1]
[41,1]
[42,1]
[43,1]
[44,1]
[45,1]
[46,1]
[47,1]
[48,1]
[49,1]
[50,1]
["DNS",0]
["DNF",0]

{"sheet":"Ark1","index":5,"n_rows":0,"n_cols":0,"rows_kept":0,"cut":false,"hidden":false,"merged":[]}